Target
D(2) dopamine receptor
Ligand
BDBM50334150
Substrate
Meas. Tech.
ChEMBL_881852 (CHEMBL2211561)
Ki
11.7±n/a nM
Citation
 Mattsson, CAndreasson, TWaters, NSonesson, C Systematic in vivo screening of a series of 1-propyl-4-arylpiperidines against dopaminergic and serotonergic properties in rat brain: a scaffold-jumping approach. J Med Chem 55:9735-50 (2012)  
Target
Name:
D(2) dopamine receptor
Synonyms:
D(2) dopamine receptor DOPAMINE D2 Long DRD2 Dopamine D2 receptor Dopamine D2 receptor (D2R) Dopamine2-like | d2
Type:
Cell-surface receptors
Mol. Mass.:
50647.10
Organism:
Homo sapiens (Human)
Description:
P14416
Residue:
443
  
Inhibitor
Name:
BDBM50334150
Synonyms:
1-(1-(4,4-bis(4-fluorophenyl)butyl)piperidin-4-yl)-1H-benzo[d]imidazol-2(3H)-one 1-(1-{3-[Bis-(4-fluoro-phenyl)-amino]-propyl}-piperidin-4-yl)-1,3-dihydro-benzoimidazol-2-one(Pimozide) 1-{1-[4,4-Bis-(4-fluoro-phenyl)-butyl]-piperidin-4-yl}-1,3-dihydro-benzoimidazol-2-one(Pimozide) MCN-JR-6238 NCGC00015802 PIMOZIDE1-{1-[4,4-BIS-(4-FLUORO-PHENYL)-BUTYL]-PIPERIDIN-4-YL}-1,3-DIHYDRO-BENZOIMIDAZOL-2-ONE R-6238
Type:
Small organic molecule
Emp. Form.:
C28H29F2N3O
Mol. Mass.:
461.5462
SMILES:
Fc1ccc(cc1)C(CCCN1CCC(CC1)n1c2ccccc2[nH]c1=O)c1ccc(F)cc1
: