Target
Proto-oncogene tyrosine-protein kinase Src
Ligand
BDBM50401871
Substrate
Meas. Tech.
ChEMBL_886108 (CHEMBL2210030)
IC50
184700±n/a nM
Citation
 Sharma, RKSingh, STiwari, RMandal, DOlsen, CEParmar, VSParang, KPrasad, AK O-Aryla,ß-d-ribofuranosides: synthesis& highly efficient biocatalytic separation of anomers and evaluation of their Src kinase inhibitory activity. Bioorg Med Chem 20:6821-30 (2012)  
Target
Name:
Proto-oncogene tyrosine-protein kinase Src
Synonyms:
Calmodulin/Proto-oncogene tyrosine-protein kinase Src Proto-oncogene c-Src SRC SRC_HUMAN V-src sarcoma (Schmidt-Ruppin A-2) viral oncogene homolog (avian) p60-Src | pp60c-src
Type:
Protein
Mol. Mass.:
59838.60
Organism:
Homo sapiens (Human)
Description:
P12931
Residue:
536
  
Inhibitor
Name:
BDBM50401871
Synonyms:
CHEMBL2205381
Type:
Small organic molecule
Emp. Form.:
C15H16O5
Mol. Mass.:
276.2845
SMILES:
OC[C@H]1O[C@H](Oc2cccc3ccccc23)[C@H](O)[C@@H]1O
: