Target
Serine/threonine-protein kinase PLK1
Ligand
BDBM50402053
Substrate
Meas. Tech.
ChEMBL_886837 (CHEMBL2210941)
Ki
333±n/a nM
Citation
 Zhang, QXia, ZMitten, MJLasko, LMKlinghofer, VBouska, JJohnson, EFPenning, TDLuo, YGiranda, VLShoemaker, ARStewart, KDDjuric, SWVasudevan, A Hit to Lead optimization of a novel class of squarate-containing polo-like kinases inhibitors. Bioorg Med Chem Lett 22:7615-22 (2012)  
Target
Name:
Serine/threonine-protein kinase PLK1
Synonyms:
PLK PLK1 Polo-like kinase 1 (PlK1) STPK13 Serine/threonine-protein kinase 13 | polo-like kinase
Type:
Serine/threonine-protein kinase
Mol. Mass.:
68277.16
Organism:
Homo sapiens (Human)
Description:
P53350
Residue:
603
  
Inhibitor
Name:
BDBM50402053
Synonyms:
CHEMBL2205446
Type:
Small organic molecule
Emp. Form.:
C26H27N5O2
Mol. Mass.:
441.5249
SMILES:
C[C@@H](Nc1c(Nc2ccnc(Nc3cccc(c3)-c3ccccc3)n2)c(=O)c1=O)C(C)(C)C
: