Target
Polycystin-2
Ligand
BDBM50402020
Substrate
Meas. Tech.
ChEMBL_886731 (CHEMBL2209631)
Ki
175±n/a nM
Citation
 Zhang, QXia, ZMitten, MJLasko, LMKlinghofer, VBouska, JJohnson, EFPenning, TDLuo, YGiranda, VLShoemaker, ARStewart, KDDjuric, SWVasudevan, A Hit to Lead optimization of a novel class of squarate-containing polo-like kinases inhibitors. Bioorg Med Chem Lett 22:7615-22 (2012)  
Target
Name:
Polycystin-2
Synonyms:
PKD2 TRPP2
Type:
PROTEIN
Mol. Mass.:
109676.85
Organism:
Homo sapiens (Human)
Description:
ChEMBL_886731
Residue:
968
  
Inhibitor
Name:
BDBM50402020
Synonyms:
CHEMBL2205426
Type:
Small organic molecule
Emp. Form.:
C23H22N6O2
Mol. Mass.:
414.4598
SMILES:
CC(C)(C)Nc1c(Nc2ccnc(Nc3ccc(cc3)-c3ccncc3)n2)c(=O)c1=O
: