Target
Receptor-type tyrosine-protein phosphatase F
Ligand
BDBM50391109
Substrate
Meas. Tech.
ChEMBL_885043 (CHEMBL2211767)
IC50
24630±n/a nM
Citation
 Dai, HLGao, LXYang, YLi, JYCheng, JGLi, JWen, RPeng, YQZheng, JB Discovery of di-indolinone as a novel scaffold for protein tyrosine phosphatase 1B inhibitors. Bioorg Med Chem Lett 22:7440-3 (2012)  
Target
Name:
Receptor-type tyrosine-protein phosphatase F
Synonyms:
LAR Leukocyte common antigen related (LAR) PTPRF_HUMAN Receptor-type tyrosine-protein phosphatase F (LAR)
Type:
Protein
Mol. Mass.:
212869.85
Organism:
Homo sapiens (Human)
Description:
P10586
Residue:
1907
  
Inhibitor
Name:
BDBM50391109
Synonyms:
CHEMBL179166 Vanadates
Type:
Small organic molecule
Emp. Form.:
O4V
Mol. Mass.:
114.9407
SMILES:
[O-][V]([O-])([O-])=O
: