Target
Tyrosine-protein phosphatase non-receptor type 2
Ligand
BDBM50402182
Substrate
Meas. Tech.
ChEMBL_885044 (CHEMBL2211768)
IC50
11470±n/a nM
Citation
 Dai, HLGao, LXYang, YLi, JYCheng, JGLi, JWen, RPeng, YQZheng, JB Discovery of di-indolinone as a novel scaffold for protein tyrosine phosphatase 1B inhibitors. Bioorg Med Chem Lett 22:7440-3 (2012)  
Target
Name:
Tyrosine-protein phosphatase non-receptor type 2
Synonyms:
PTN2_HUMAN PTPT T-cell protein-tyrosine phosphatase TCPTP Tyrosine-protein phosphatase non-receptor type 2 (TC-PTP)
Type:
Protein
Mol. Mass.:
48481.80
Organism:
Homo sapiens (Human)
Description:
P17706
Residue:
415
  
Inhibitor
Name:
BDBM50402182
Synonyms:
CHEMBL2208249
Type:
Small organic molecule
Emp. Form.:
C22H13BrN2O4
Mol. Mass.:
449.254
SMILES:
Brc1ccc2NC(=O)\C(=C\c3ccc(CN4C(=O)C(=O)c5ccccc45)o3)c2c1
: