Target
Tyrosine-protein phosphatase non-receptor type 1
Ligand
BDBM50402192
Substrate
Meas. Tech.
ChEMBL_885045 (CHEMBL2211769)
IC50
7630±n/a nM
Citation
 Dai, HLGao, LXYang, YLi, JYCheng, JGLi, JWen, RPeng, YQZheng, JB Discovery of di-indolinone as a novel scaffold for protein tyrosine phosphatase 1B inhibitors. Bioorg Med Chem Lett 22:7440-3 (2012)  
Target
Name:
Tyrosine-protein phosphatase non-receptor type 1
Synonyms:
PTN1_HUMAN PTPN1 Protein tyrosine phosphatase-1B (PTP1B) Protein-tyrosine phosphatase 1B (PTP1B) Tyrosine-protein phosphatase non-receptor type 1 (PTP1B)
Type:
Protein phosphatase
Mol. Mass.:
49963.76
Organism:
Homo sapiens (Human)
Description:
Human recombinant GST-fusion PTP1B (1-435).
Residue:
435
  
Inhibitor
Name:
BDBM50402192
Synonyms:
CHEMBL2208248
Type:
Small organic molecule
Emp. Form.:
C22H14N2O4
Mol. Mass.:
370.3576
SMILES:
O=C1Nc2ccccc2\C1=C/c1ccc(CN2C(=O)C(=O)c3ccccc23)o1
: