Target
Thromboxane A2 receptor
Ligand
BDBM50003795
Substrate
Meas. Tech.
ChEMBL_209607 (CHEMBL816693)
Kd
3981.07±n/a nM
Citation
 Campbell, ICollington, EFinch, HHayes, RLumley, PMills, KRobertson, GWharton, KWatts, I Synthesis and pharmacological evaluation of combined Thromboxane receptor antagonists/thromboxane synthase inhibitors: Pyridine-containing amino-prostanoids Bioorg Med Chem Lett 1:695-698 (1991)    Article 
Target
Name:
Thromboxane A2 receptor
Synonyms:
Prostanoid TP receptor TBXA2R Thromboxane Thromboxane Beta
Type:
Enyzme
Mol. Mass.:
37445.28
Organism:
Homo sapiens (Human)
Description:
P21731
Residue:
343
  
Inhibitor
Name:
BDBM50003795
Synonyms:
5-[1-Pyridin-3-yl-1-(3-trifluoromethyl-phenyl)-meth-(E)-ylideneaminooxy]-pentanoic acid CHEMBL280728 ridogrel
Type:
Small organic molecule
Emp. Form.:
C18H17F3N2O3
Mol. Mass.:
366.3344
SMILES:
OC(=O)CCCCO\N=C(\c1cccnc1)c1cccc(c1)C(F)(F)F
: