Target
5-hydroxytryptamine receptor 1A
Ligand
BDBM50403651
Substrate
Meas. Tech.
ChEBML_1021
Ki
<1000±n/a nM
Citation
 Minarini, ABudriesi, RChiarini, ALeonardi, AMelchiorre, C Search for alpha 1-adrenoceptor subtypes selective antagonists: design, synthesis and biological activity of cystazosin, an alpha 1D-adrenoceptor antagonist. Bioorg Med Chem Lett 8:1353-8 (1999)  
Target
Name:
5-hydroxytryptamine receptor 1A
Synonyms:
5-HT-1A 5-hydroxytryptamine receptor 1A (5-HT-1A) ADRB2RL1 Dopamine D2 receptor and serotonin 1a receptor HTR1A | Serotonin receptor 1A
Type:
Mol. Mass.:
46122.49
Organism:
Homo sapiens (Human)
Description:
Residue:
422
  
Inhibitor
Name:
BDBM50403651
Synonyms:
CHEMBL29591
Type:
Small organic molecule
Emp. Form.:
C21H27N5O4S2
Mol. Mass.:
477.6
SMILES:
COc1cc2nc(nc(N)c2cc1OC)N(C)CCSSCCN(C)C(=O)c1ccco1
: