Target
Integrin alpha-V/beta-3
Ligand
BDBM50059133
Substrate
Meas. Tech.
ChEMBL_220414 (CHEMBL843254)
Ki
2±n/a nM
Citation
 Keenan, RMLago, MAMiller, WHAli, FECousins, RDHall, LBHwang, SMJakas, DRKwon, CLouden, CNguyen, TTOhlstein, EHRieman, DJRoss, STSamanen, JMSmith, BRStadel, JTakata, DTVickery, LYuan, CCYue, TL Discovery of an imidazopyridine-containing 1,4-benzodiazepine nonpeptide vitronectin receptor (alpha v beta 3) antagonist with efficacy in a restenosis model. Bioorg Med Chem Lett 8:3171-6 (1999)  
Target
Name:
Integrin alpha-V/beta-3
Synonyms:
ITGAV/ITGB3 | Integrin beta-3/Vitronectin receptor alpha
Type:
Enzyme
Mol. Mass.:
Description:
Components:
This complex has 2 components.
Component 1
Name:
Integrin alpha-V
Synonyms:
ITAV_HUMAN Integrin alpha-V/alpha-5 VNRA Vitronectin receptor | Vitronectin receptor subunit alpha
Type:
PROTEIN
Mol. Mass.:
116024.92
Organism:
Homo sapiens (Human)
Description:
ChEMBL_582336
Residue:
1048
  
Component 2
Name:
Integrin beta-3
Synonyms:
CD_antigen=CD61 GPIIIa ITGB3 Platelet membrane glycoprotein IIIa
Type:
Protein
Mol. Mass.:
87038.91
Organism:
Homo sapiens (Human)
Description:
P05106
Residue:
788
  
Inhibitor
Name:
BDBM50059133
Synonyms:
CHEMBL50106 {(S)-7-[(1H-Benzoimidazol-2-ylmethyl)-methyl-carbamoyl]-4-methyl-3-oxo-2,3,4,5-tetrahydro-1H-benzo[e][1,4]diazepin-2-yl}-acetic acid | {7-[(1H-Benzoimidazol-2-ylmethyl)-methyl-carbamoyl]-4-methyl-3-oxo-2,3,4,5-tetrahydro-1H-benzo[e][1,4]diazepin-2-yl}-acetic acid
Type:
Small organic molecule
Emp. Form.:
C22H23N5O4
Mol. Mass.:
421.4491
SMILES:
CN(Cc1nc2ccccc2[nH]1)C(=O)c1ccc2N[C@@H](CC(O)=O)C(=O)N(C)Cc2c1
: