Target
5-hydroxytryptamine receptor 7
Ligand
BDBM50403766
Substrate
Meas. Tech.
ChEBML_3724
Ki
631±n/a nM
Citation
 López-Rodríguez, MLPorras, EBenhamú, BRamos, JAMorcillo, MJLavandera, JL First pharmacophoric hypothesis for 5-HT7 antagonism. Bioorg Med Chem Lett 10:1097-100 (2000)  
Target
Name:
5-hydroxytryptamine receptor 7
Synonyms:
5-HT-7 5-HT7 5-HT7S 5HT7 HTR7 | Serotonin receptor 7
Type:
G Protein-Coupled Receptor (GPCR)
Mol. Mass.:
53573.08
Organism:
Homo sapiens (Human)
Description:
P34969
Residue:
479
  
Inhibitor
Name:
BDBM50403766
Synonyms:
CHEMBL12654
Type:
Small organic molecule
Emp. Form.:
C21H30N2O2S
Mol. Mass.:
374.54
SMILES:
C[C@H](CCN1CCC[C@H](C)C1)N(C)S(=O)(=O)c1cccc2ccccc12
: