Target
Thymidylate synthase
Ligand
BDBM50403879
Substrate
Meas. Tech.
ChEBML_209980
Ki
0.170000±n/a nM
Citation
 Bavetsias, VMarriott, JHTheti, DSMelin, JCWilson, SCJackman, AL Cyclopenta[g]quinazoline-based antifolates: the effect of the chirality at the 6-position on the inhibition of thymidylate synthase (TS). Bioorg Med Chem Lett 11:3015-7 (2001)  
Target
Name:
Thymidylate synthase
Synonyms:
TS TYSY_MOUSE | Tyms
Type:
PROTEIN
Mol. Mass.:
34957.15
Organism:
Mus musculus
Description:
ChEMBL_1340097
Residue:
307
  
Inhibitor
Name:
BDBM50403879
Synonyms:
CHEMBL320217
Type:
Small organic molecule
Emp. Form.:
C32H33N9O7
Mol. Mass.:
655.6605
SMILES:
Cc1nc2cc3CC[C@H](N(CC#C)c4ccc(cc4)C(=O)N[C@@H](CCC(=O)N[C@H](CCC(O)=O)c4nnn[nH]4)C(O)=O)c3cc2c(=O)[nH]1
: