Target
5-hydroxytryptamine receptor 2A
Ligand
BDBM31005
Substrate
Meas. Tech.
ChEBML_2508
IC50
10±n/a nM
Citation
 Andrés, JIAlcázar, JAlonso, JMDíaz, AFernández, JGil, PIturrino, LMatesanz, EMeert, TFMegens, ASipido, VK Synthesis and structure-activity relationship of 2-(aminoalkyl)-2,3,3a,8-tetrahydrodibenzo[c,f]isoxazolo[2,3-a]azepine derivatives: a novel series of 5-HT(2A/2C) receptor antagonists. Part 1. Bioorg Med Chem Lett 12:243-8 (2001)  
Target
Name:
5-hydroxytryptamine receptor 2A
Synonyms:
5-HT-2 5-HT2A 5-hydroxytryptamine receptor 2A (5HT-2A) 5HT2A_HUMAN HTR2A | Serotonin receptor 2A
Type:
undefined
Mol. Mass.:
52607.65
Organism:
Homo sapiens (Human)
Description:
P28223
Residue:
471
  
Inhibitor
Name:
BDBM31005
Synonyms:
2-methyl-1,2,3,4,10,14b-hexahydrodibenzo[c,f]pyrazino[1,2-a]azepine MLS000069681 cid_68551
Type:
Small organic molecule
Emp. Form.:
C18H21ClN2
Mol. Mass.:
300.826
SMILES:
Cl.CN1CCN2C(C1)c1ccccc1Cc1ccccc21
: