Target
Adenosine kinase
Ligand
BDBM50375654
Substrate
Meas. Tech.
ChEBML_31135
IC50
25.7±n/a nM
Citation
 González, MPMoldes del Carmen Terán, M A TOPS-MODE approach to predict adenosine kinase inhibition. Bioorg Med Chem Lett 14:3077-9 (2004)  
Target
Name:
Adenosine kinase
Synonyms:
ADK | ADK_HUMAN
Type:
PROTEIN
Mol. Mass.:
40545.97
Organism:
Homo sapiens (Human)
Description:
ChEMBL_1467841
Residue:
362
  
Inhibitor
Name:
BDBM50375654
Synonyms:
CHEMBL99203 | US11633415, Compound 5-iodotubercidin
Type:
Small organic molecule
Emp. Form.:
C11H13IN4O4
Mol. Mass.:
392.1498
SMILES:
Nc1ncnc2n(cc(I)c12)[C@@H]1O[C@H](CO)[C@@H](O)[C@H]1O
: