Target
Cannabinoid receptor 1
Ligand
BDBM50404269
Substrate
Meas. Tech.
ChEBML_46615
EC50
39811±n/a nM
Citation
 Parkkari, TSavinainen, JRRauhala, ALTolonen, TLNevalainen, TLaitinen, JTGynther, JJärvinen, T Synthesis and CB1 receptor activities of novel arachidonyl alcohol derivatives. Bioorg Med Chem Lett 14:3231-4 (2004)  
Target
Name:
Cannabinoid receptor 1
Synonyms:
Brain-type cannabinoid receptor CB-R CNR1_RAT Cannabinoid receptor Cnr1 | Skr6
Type:
G Protein-Coupled Receptor (GPCR)
Mol. Mass.:
52856.55
Organism:
Rattus norvegicus (rat)
Description:
P20272
Residue:
473
  
Inhibitor
Name:
BDBM50404269
Synonyms:
CHEMBL320549
Type:
Small organic molecule
Emp. Form.:
C23H38O4
Mol. Mass.:
378.5454
SMILES:
CCCCC\C=C/C\C=C/C\C=C/C\C=C/CCCCOC(=O)[C@@H](O)CO
: