Target
Beta-1 adrenergic receptor
Ligand
BDBM50404759
Substrate
Meas. Tech.
ChEMBL_37080 (CHEMBL650921)
Kd
251±n/a nM
Citation
 Erhardt, PWWoo, CMGorczynski, RJAnderson, WG Ultra-short-acting beta-adrenergic receptor blocking agents. 1. (Aryloxy)propanolamines containing esters in the nitrogen substituent. J Med Chem 25:1402-7 (1983)  
Target
Name:
Beta-1 adrenergic receptor
Synonyms:
ADRB1 adrenergic Beta1
Type:
Enzyme Catalytic Domain
Mol. Mass.:
50540.48
Organism:
GUINEA PIG
Description:
adrenergic Beta1 ADRB1 GUINEA PIG::B0FL73
Residue:
467
  
Inhibitor
Name:
BDBM50404759
Synonyms:
CHEMBL31591
Type:
Small organic molecule
Emp. Form.:
C20H25NO4
Mol. Mass.:
343.4168
SMILES:
CCOC(=O)c1ccc(CNCC(O)COc2ccccc2C)cc1
: