Target
Beta-1 adrenergic receptor
Ligand
BDBM50404752
Substrate
Meas. Tech.
ChEMBL_37080 (CHEMBL650921)
Kd
251±n/a nM
Citation
 Erhardt, PWWoo, CMGorczynski, RJAnderson, WG Ultra-short-acting beta-adrenergic receptor blocking agents. 1. (Aryloxy)propanolamines containing esters in the nitrogen substituent. J Med Chem 25:1402-7 (1983)  
Target
Name:
Beta-1 adrenergic receptor
Synonyms:
ADRB1 adrenergic Beta1
Type:
Enzyme Catalytic Domain
Mol. Mass.:
50540.48
Organism:
GUINEA PIG
Description:
adrenergic Beta1 ADRB1 GUINEA PIG::B0FL73
Residue:
467
  
Inhibitor
Name:
BDBM50404752
Synonyms:
CHEMBL284808
Type:
Small organic molecule
Emp. Form.:
C15H23NO4
Mol. Mass.:
281.3474
SMILES:
CCOC(=O)CCCNCC(O)COc1ccccc1
: