Target
Beta-1 adrenergic receptor
Ligand
BDBM50404761
Substrate
Meas. Tech.
ChEMBL_37085 (CHEMBL650926)
Kd
398±n/a nM
Citation
 Erhardt, PWWoo, CMGorczynski, RJAnderson, WG Ultra-short-acting beta-adrenergic receptor blocking agents. 1. (Aryloxy)propanolamines containing esters in the nitrogen substituent. J Med Chem 25:1402-7 (1983)  
Target
Name:
Beta-1 adrenergic receptor
Synonyms:
ADRB1 adrenergic Beta1
Type:
Enzyme Catalytic Domain
Mol. Mass.:
50540.48
Organism:
GUINEA PIG
Description:
adrenergic Beta1 ADRB1 GUINEA PIG::B0FL73
Residue:
467
  
Inhibitor
Name:
BDBM50404761
Synonyms:
CHEMBL30558
Type:
Small organic molecule
Emp. Form.:
C18H21NO4
Mol. Mass.:
315.3636
SMILES:
OC(CNCCC(=O)Oc1ccccc1)COc1ccccc1
: