Target
Beta-1 adrenergic receptor
Ligand
BDBM50404775
Substrate
Meas. Tech.
ChEMBL_37080 (CHEMBL650921)
Kd
316±n/a nM
Citation
 Erhardt, PWWoo, CMGorczynski, RJAnderson, WG Ultra-short-acting beta-adrenergic receptor blocking agents. 1. (Aryloxy)propanolamines containing esters in the nitrogen substituent. J Med Chem 25:1402-7 (1983)  
Target
Name:
Beta-1 adrenergic receptor
Synonyms:
ADRB1 adrenergic Beta1
Type:
Enzyme Catalytic Domain
Mol. Mass.:
50540.48
Organism:
GUINEA PIG
Description:
adrenergic Beta1 ADRB1 GUINEA PIG::B0FL73
Residue:
467
  
Inhibitor
Name:
BDBM50404775
Synonyms:
CHEMBL31888
Type:
Small organic molecule
Emp. Form.:
C13H15NO2
Mol. Mass.:
217.2637
SMILES:
NCC(O)COc1cccc2ccccc12
: