Target
Beta-2 adrenergic receptor
Ligand
BDBM50404775
Substrate
Meas. Tech.
ChEMBL_38008 (CHEMBL655218)
Kd
501.19±n/a nM
Citation
 Erhardt, PWWoo, CMGorczynski, RJAnderson, WG Ultra-short-acting beta-adrenergic receptor blocking agents. 1. (Aryloxy)propanolamines containing esters in the nitrogen substituent. J Med Chem 25:1402-7 (1983)  
Target
Name:
Beta-2 adrenergic receptor
Synonyms:
ADRB2_CAVPO adrenergic Beta2
Type:
Enzyme Catalytic Domain
Mol. Mass.:
46993.24
Organism:
GUINEA PIG
Description:
adrenergic Beta2 ADRB2 GUINEA PIG::Q8K4Z4
Residue:
418
  
Inhibitor
Name:
BDBM50404775
Synonyms:
CHEMBL31888
Type:
Small organic molecule
Emp. Form.:
C13H15NO2
Mol. Mass.:
217.2637
SMILES:
NCC(O)COc1cccc2ccccc12
: