Target
Beta-2 adrenergic receptor
Ligand
BDBM50404790
Substrate
Meas. Tech.
ChEMBL_38009 (CHEMBL655219)
Kd
12.59±n/a nM
Citation
 Erhardt, PWWoo, CMAnderson, WGGorczynski, RJ Ultra-short-acting beta-adrenergic receptor blocking agents. 2. (Aryloxy)propanolamines containing esters on the aryl function. J Med Chem 25:1408-12 (1983)  
Target
Name:
Beta-2 adrenergic receptor
Synonyms:
ADRB2_CAVPO adrenergic Beta2
Type:
Enzyme Catalytic Domain
Mol. Mass.:
46993.24
Organism:
GUINEA PIG
Description:
adrenergic Beta2 ADRB2 GUINEA PIG::Q8K4Z4
Residue:
418
  
Inhibitor
Name:
BDBM50404790
Synonyms:
CHEMBL13284
Type:
Small organic molecule
Emp. Form.:
C14H21NO4
Mol. Mass.:
267.3208
SMILES:
COC(=O)c1ccccc1OCC(O)CNC(C)C
: