Target
Adenosylhomocysteinase
Ligand
BDBM50405655
Substrate
Meas. Tech.
ChEBML_197202
Ki
35±n/a nM
Citation
 Narayanan, SRKeller, BTBorcherding, DRScholtz, SABorchardt, RT 9-(trans-2',trans-3'-dihydroxycyclopent-4'-enyl) derivatives of adenine and 3-deazaadenine: potent inhibitors of bovine liver S-adenosylhomocysteine hydrolase. J Med Chem 31:500-3 (1988)  
Target
Name:
Adenosylhomocysteinase
Synonyms:
AHCY SAHH | SAHH_HUMAN
Type:
PROTEIN
Mol. Mass.:
47714.06
Organism:
Homo sapiens (Human)
Description:
ChEMBL_1507791
Residue:
432
  
Inhibitor
Name:
BDBM50405655
Synonyms:
CHEMBL147260
Type:
Small organic molecule
Emp. Form.:
C11H12N4O2
Mol. Mass.:
232.2386
SMILES:
Nc1nccc2n(cnc12)C1C=C[C@@H](O)[C@H]1O
: