Target
Thymidylate synthase
Ligand
BDBM50405732
Substrate
Meas. Tech.
ChEBML_209789
Ki
0.041000±n/a nM
Citation
 Pawelczak, KJones, TRKempny, MJackman, ALNewell, DRKrzyzanowski, LRzeszotarska, B Quinazoline antifolates inhibiting thymidylate synthase: synthesis of four oligo(L-gamma-glutamyl) conjugates of N10-propargyl-5,8-dideazafolic acid and their enzyme inhibition. J Med Chem 32:160-5 (1989)  
Target
Name:
Thymidylate synthase
Synonyms:
TS TYMS Thymidylate synthase (TS) | Thymidylate synthase/GAR transformylase/AICAR transformylase
Type:
Enzyme
Mol. Mass.:
35718.07
Organism:
Homo sapiens (Human)
Description:
Residue:
313
  
Inhibitor
Name:
BDBM50405732
Synonyms:
CHEMBL290277
Type:
Small organic molecule
Emp. Form.:
C39H44N8O15
Mol. Mass.:
864.8113
SMILES:
Nc1nc2ccc(CN(CC#C)c3ccc(cc3)C(=O)NC(CCC(=O)NC(CCC(=O)NC(CCC(=O)NC(CCC(O)=O)C(O)=O)C(O)=O)C(O)=O)C(O)=O)cc2c(=O)[nH]1
: