Target
Neutrophil elastase
Ligand
BDBM50291754
Substrate
Meas. Tech.
ChEMBL_21101 (CHEMBL633695)
Ki
5.012E3±n/a nM
KOFF
7.762E-5 s-1
KON
1.514E1 M-1s-1
Citation
 Krantz, ASpencer, RWTam, TFLiak, TJCopp, LJThomas, EMRafferty, SP Design and synthesis of 4H-3,1-benzoxazin-4-ones as potent alternate substrate inhibitors of human leukocyte elastase. J Med Chem 33:464-79 (1990)  
Target
Name:
Neutrophil elastase
Synonyms:
Bone marrow serine protease Coagulation factor X ELANE Elastase HLE Leukocyte elastase Medullasin Neutrophil elastase (HNE) PMN elastase Trypsin
Type:
Enzyme
Mol. Mass.:
28532.38
Organism:
Homo sapiens (Human)
Description:
P08246
Residue:
267
  
Inhibitor
Name:
BDBM50291754
Synonyms:
2-Amino-5-ethyl-benzo[d][1,3]oxazin-4-one | CHEMBL146219
Type:
Small organic molecule
Emp. Form.:
C10H10N2O2
Mol. Mass.:
190.1986
SMILES:
CCc1cccc2nc(N)oc(=O)c12
: