Target
Dihydrofolate reductase
Ligand
BDBM50138707
Substrate
Meas. Tech.
ChEMBL_54726 (CHEMBL668339)
Ki
151±n/a nM
Citation
 Selassie, CDLi, RLPoe, MHansch, C On the optimization of hydrophobic and hydrophilic substituent interactions of 2,4-diamino-5-(substituted-benzyl)pyrimidines with dihydrofolate reductase. J Med Chem 34:46-54 (1991)  
Target
Name:
Dihydrofolate reductase
Synonyms:
1.5.1.3 folA | t0090
Type:
PROTEIN
Mol. Mass.:
17976.56
Organism:
Salmonella enterica subsp. enterica serovar Typhi
Description:
ChEMBL_13019
Residue:
159
  
Inhibitor
Name:
BDBM50138707
Synonyms:
5-(4-Methoxy-benzyl)-pyrimidine-2,4-diamine | CHEMBL19023
Type:
Small organic molecule
Emp. Form.:
C12H14N4O
Mol. Mass.:
230.2658
SMILES:
COc1ccc(Cc2cnc(N)nc2N)cc1
: