Target
Dihydrofolate reductase
Ligand
BDBM50081914
Substrate
Meas. Tech.
ChEMBL_54726 (CHEMBL668339)
Ki
407±n/a nM
Citation
 Selassie, CDLi, RLPoe, MHansch, C On the optimization of hydrophobic and hydrophilic substituent interactions of 2,4-diamino-5-(substituted-benzyl)pyrimidines with dihydrofolate reductase. J Med Chem 34:46-54 (1991)  
Target
Name:
Dihydrofolate reductase
Synonyms:
1.5.1.3 folA | t0090
Type:
PROTEIN
Mol. Mass.:
17976.56
Organism:
Salmonella enterica subsp. enterica serovar Typhi
Description:
ChEMBL_13019
Residue:
159
  
Inhibitor
Name:
BDBM50081914
Synonyms:
5-(3-Heptyloxy-benzyl)-pyrimidine-2,4-diamine | CHEMBL285209
Type:
Small organic molecule
Emp. Form.:
C18H26N4O
Mol. Mass.:
314.4252
SMILES:
CCCCCCCOc1cccc(Cc2cnc(N)nc2N)c1
: