Target
Polyunsaturated fatty acid 5-lipoxygenase
Ligand
BDBM50009015
Substrate
Meas. Tech.
ChEBML_177026
IC50
1400±n/a nM
Citation
 Bruneau, PDelvare, CEdwards, MPMcMillan, RM Indazolinones, a new series of redox-active 5-lipoxygenase inhibitors with built-in selectivity and oral activity. J Med Chem 34:1028-36 (1991)  
Target
Name:
Polyunsaturated fatty acid 5-lipoxygenase
Synonyms:
Alox5 LOX5_RAT
Type:
PROTEIN
Mol. Mass.:
78082.31
Organism:
Rattus norvegicus
Description:
ChEMBL_1432947
Residue:
673
  
Inhibitor
Name:
BDBM50009015
Synonyms:
2-(2-Chloro-pyridin-3-ylmethyl)-1,2-dihydro-indazol-3-one | CHEMBL3144582
Type:
Small organic molecule
Emp. Form.:
C13H10ClN3O
Mol. Mass.:
259.691
SMILES:
Clc1ncccc1Cn1[nH]c2ccccc2c1=O
: