Target
Polyunsaturated fatty acid 5-lipoxygenase
Ligand
BDBM50008988
Substrate
Meas. Tech.
ChEBML_177026
IC50
11000±n/a nM
Citation
 Bruneau, PDelvare, CEdwards, MPMcMillan, RM Indazolinones, a new series of redox-active 5-lipoxygenase inhibitors with built-in selectivity and oral activity. J Med Chem 34:1028-36 (1991)  
Target
Name:
Polyunsaturated fatty acid 5-lipoxygenase
Synonyms:
Alox5 LOX5_RAT
Type:
PROTEIN
Mol. Mass.:
78082.31
Organism:
Rattus norvegicus
Description:
ChEMBL_1432947
Residue:
673
  
Inhibitor
Name:
BDBM50008988
Synonyms:
2-(1-Naphthalen-1-yl-ethyl)-1,2-dihydro-indazol-3-one | CHEMBL3144581
Type:
Small organic molecule
Emp. Form.:
C19H16N2O
Mol. Mass.:
288.3431
SMILES:
C[C@@H](c1cccc2ccccc12)n1[nH]c2ccccc2c1=O
: