Target
Polyunsaturated fatty acid 5-lipoxygenase
Ligand
BDBM50009002
Substrate
Meas. Tech.
ChEBML_98490
IC50
200±n/a nM
Citation
 Bruneau, PDelvare, CEdwards, MPMcMillan, RM Indazolinones, a new series of redox-active 5-lipoxygenase inhibitors with built-in selectivity and oral activity. J Med Chem 34:1028-36 (1991)  
Target
Name:
Polyunsaturated fatty acid 5-lipoxygenase
Synonyms:
5-LO 5-Lipoxygenase (5-LO) 5-Lipoygenase ALOX5 LOG5 | LOX5_HUMAN
Type:
Enzyme
Mol. Mass.:
77972.74
Organism:
Homo sapiens (Human)
Description:
Recombinant protein was purified from E. coli lysate. After ammonium sulfate precipitation and subsequent steps, the supernatant (S100) was used for 5-LO activity assay.
Residue:
674
  
Inhibitor
Name:
BDBM50009002
Synonyms:
2-Methyl-1,2-dihydro-indazol-3-one | CHEMBL3144583
Type:
Small organic molecule
Emp. Form.:
C8H8N2O
Mol. Mass.:
148.1619
SMILES:
Cn1[nH]c2ccccc2c1=O
: