Target
7-dehydrocholesterol reductase
Ligand
BDBM50406620
Substrate
Meas. Tech.
ChEMBL_53601 (CHEMBL665488)
Ki
33±n/a nM
Citation
 Ator, MASchmidt, SJAdams, JLDolle, REKruse, LIFrey, CLBarone, JM Synthesis, specificity, and antifungal activity of inhibitors of the Candida albicans delta 24-sterol methyltransferase. J Med Chem 35:100-6 (1992)  
Target
Name:
7-dehydrocholesterol reductase
Synonyms:
DHCR7_RAT | Dhcr7
Type:
PROTEIN
Mol. Mass.:
54168.97
Organism:
Rattus norvegicus
Description:
ChEMBL_53595
Residue:
471
  
Inhibitor
Name:
BDBM50406620
Synonyms:
CHEMBL9864
Type:
Small organic molecule
Emp. Form.:
C29H46N2O
Mol. Mass.:
438.6883
SMILES:
C[C@H](CCc1ncc[nH]1)C1CC[C@@]2(C)C3=C(CC[C@]12C)[C@@]1(C)CC[C@H](O)C(C)(C)C1CC3
: