Target
Thymidylate synthase
Ligand
BDBM50406718
Substrate
Meas. Tech.
ChEBML_209982
Ki
0.970000±n/a nM
Citation
 Bisset, GMPawelczak, KJackman, ALCalvert, AHHughes, LR Syntheses and thymidylate synthase inhibitory activity of the poly-gamma-glutamyl conjugates of N-[5-[N-(3,4-dihydro-2-methyl-4-oxoquinazolin-6-ylmethyl)-N-methylamino ]-2-thenoyl]-L-glutamic acid (ICI D1694) and other quinazoline antifolates. J Med Chem 35:859-66 (1992)  
Target
Name:
Thymidylate synthase
Synonyms:
TS TYSY_MOUSE | Tyms
Type:
PROTEIN
Mol. Mass.:
34957.15
Organism:
Mus musculus
Description:
ChEMBL_1340097
Residue:
307
  
Inhibitor
Name:
BDBM50406718
Synonyms:
CHEMBL1202140
Type:
Small organic molecule
Emp. Form.:
C34H36N6O12
Mol. Mass.:
720.6826
SMILES:
OC(=O)CC[C@H](NC(=O)CC[C@H](NC(=O)CC[C@H](NC(=O)c1ccc(cc1)N(CC#C)Cc1ccc2nc[nH]c(=O)c2c1)C(O)=O)C(O)=O)C(O)=O
: