Target
Thymidylate synthase
Ligand
BDBM50406722
Substrate
Meas. Tech.
ChEBML_209982
Ki
24±n/a nM
Citation
 Bisset, GMPawelczak, KJackman, ALCalvert, AHHughes, LR Syntheses and thymidylate synthase inhibitory activity of the poly-gamma-glutamyl conjugates of N-[5-[N-(3,4-dihydro-2-methyl-4-oxoquinazolin-6-ylmethyl)-N-methylamino ]-2-thenoyl]-L-glutamic acid (ICI D1694) and other quinazoline antifolates. J Med Chem 35:859-66 (1992)  
Target
Name:
Thymidylate synthase
Synonyms:
TS TYSY_MOUSE | Tyms
Type:
PROTEIN
Mol. Mass.:
34957.15
Organism:
Mus musculus
Description:
ChEMBL_1340097
Residue:
307
  
Inhibitor
Name:
BDBM50406722
Synonyms:
CHEMBL353302
Type:
Small organic molecule
Emp. Form.:
C26H29N5O9S
Mol. Mass.:
587.602
SMILES:
CN(Cc1ccc2nc(C)[nH]c(=O)c2c1)c1ccc(s1)C(=O)N[C@@H](CCC(=O)N[C@@H](CCC(O)=O)C(O)=O)C(O)=O
: