Target
5-hydroxytryptamine receptor 2C
Ligand
BDBM50406761
Substrate
Meas. Tech.
ChEBML_1850
IC50
1000±n/a nM
Citation
 Street, LJBaker, RCastro, JLChambers, MSGuiblin, ARHobbs, SCMatassa, VGReeve, AJBeer, MSMiddlemiss, DN Synthesis and serotonergic activity of 5-(oxadiazolyl)tryptamines: potent agonists for 5-HT1D receptors. J Med Chem 36:1529-38 (1993)  
Target
Name:
5-hydroxytryptamine receptor 2C
Synonyms:
5-HT-2C 5-HT2C-INI 5-HTR2C 5-hydroxytryptamine receptor 2C (5-HT-2C) 5HT-1C HTR1C Serotonin (5-HT3) receptor Serotonin Receptor 2C
Type:
G Protein-Coupled Receptor (GPCR)
Mol. Mass.:
51836.79
Organism:
Homo sapiens (Human)
Description:
P28335
Residue:
458
  
Inhibitor
Name:
BDBM50406761
Synonyms:
CHEMBL38482
Type:
Small organic molecule
Emp. Form.:
C15H16N4O
Mol. Mass.:
268.3137
SMILES:
NCCc1c[nH]c2ccc(cc12)-c1nc(no1)C1CC1
: