Target
5-hydroxytryptamine receptor 1D
Ligand
BDBM50406788
Substrate
Meas. Tech.
ChEBML_1965
IC50
79±n/a nM
Citation
 Street, LJBaker, RCastro, JLChambers, MSGuiblin, ARHobbs, SCMatassa, VGReeve, AJBeer, MSMiddlemiss, DN Synthesis and serotonergic activity of 5-(oxadiazolyl)tryptamines: potent agonists for 5-HT1D receptors. J Med Chem 36:1529-38 (1993)  
Target
Name:
5-hydroxytryptamine receptor 1D
Synonyms:
5HT1D_PIG Serotonin 1d (5-HT1d) receptor
Type:
PROTEIN
Mol. Mass.:
32680.56
Organism:
Sus scrofa
Description:
ChEMBL_1963
Residue:
291
  
Inhibitor
Name:
BDBM50406788
Synonyms:
CHEMBL35875
Type:
Small organic molecule
Emp. Form.:
C14H17N5O
Mol. Mass.:
271.3177
SMILES:
CN(C)CCc1c[nH]c2ccc(cc12)-c1nc(N)no1
: