Target
Epidermal growth factor receptor
Ligand
BDBM50407165
Substrate
Meas. Tech.
ChEMBL_202293 (CHEMBL814060)
IC50
58000±n/a nM
Citation
 Stevens, MFMcCall, CJLelieveld, PAlexander, PRichter, ADavies, DE Structural studies on bioactive compounds. 23. Synthesis of polyhydroxylated 2-phenylbenzothiazoles and a comparison of their cytotoxicities and pharmacological properties with genistein and quercetin. J Med Chem 37:1689-95 (1994)  
Target
Name:
Epidermal growth factor receptor
Synonyms:
EGF Receptor Substrate EGFR_HUMAN ERBB1 Epidermal Growth Factor Receptor erbB-1 Epidermal growth factor receptor (EGFR) HER1 Proto-oncogene c-ErbB-1 Tyrosine-Protein Kinase ErbB-1
Type:
Receptor Kinase Domain
Mol. Mass.:
134279.59
Organism:
Homo sapiens (Human)
Description:
P00533
Residue:
1210
  
Inhibitor
Name:
BDBM50407165
Synonyms:
CHEMBL47966
Type:
Small organic molecule
Emp. Form.:
C12H10N2O3
Mol. Mass.:
230.2194
SMILES:
Oc1ccc(cc1)N=Nc1ccc(O)cc1O
: