Target
Gag-Pol polyprotein [489-587]
Ligand
BDBM949
Substrate
Meas. Tech.
ChEMBL_159137 (CHEMBL859312)
Ki
28.8±n/a nM
Citation
 Kroemer, RTEttmayer, PHecht, P 3D-quantitative structure-activity relationships of human immunodeficiency virus type-1 proteinase inhibitors: comparative molecular field analysis of 2-heterosubstituted statine derivatives-implications for the design of novel inhibitors. J Med Chem 38:4917-28 (1996)  
Target
Name:
Gag-Pol polyprotein [489-587]
Synonyms:
Human immunodeficiency virus type 1 protease Pol polyprotein | gag-pol
Type:
Enzyme Subunit
Mol. Mass.:
10781.16
Organism:
Human immunodeficiency virus type 1
Description:
P04585[489-587]
Residue:
99
  
Inhibitor
Name:
BDBM949
Synonyms:
5PhBuCOOH deriv. Tle-Val-Sta | benzyl N-[(1S)-1-{[(2S,3R,4R)-4-(benzylamino)-4-{[(1S)-1-(benzylcarbamoyl)-2-methylpropyl]carbamoyl}-3-hydroxy-1-phenylbutan-2-yl]carbamoyl}-2-(1H-imidazol-4-yl)ethyl]carbamate
Type:
Small organic molecule
Emp. Form.:
C44H51N7O6
Mol. Mass.:
773.919
SMILES:
CC(C)[C@H](NC(=O)[C@H](NCc1ccccc1)[C@H](O)[C@H](Cc1ccccc1)NC(=O)[C@H](Cc1cnc[nH]1)NC(=O)OCc1ccccc1)C(=O)NCc1ccccc1
: