Target
Gag-Pol polyprotein [489-587]
Ligand
BDBM1200
Substrate
Meas. Tech.
ChEMBL_159137 (CHEMBL859312)
Ki
91.2±n/a nM
Citation
 Kroemer, RTEttmayer, PHecht, P 3D-quantitative structure-activity relationships of human immunodeficiency virus type-1 proteinase inhibitors: comparative molecular field analysis of 2-heterosubstituted statine derivatives-implications for the design of novel inhibitors. J Med Chem 38:4917-28 (1996)  
Target
Name:
Gag-Pol polyprotein [489-587]
Synonyms:
Human immunodeficiency virus type 1 protease Pol polyprotein | gag-pol
Type:
Enzyme Subunit
Mol. Mass.:
10781.16
Organism:
Human immunodeficiency virus type 1
Description:
P04585[489-587]
Residue:
99
  
Inhibitor
Name:
BDBM1200
Synonyms:
2-Aminobenzyl-Substituted AHPPA deriv. 17 | tert-butyl N-[(2S,3R,4R)-4-{[(4-ethoxyphenyl)methyl]amino}-3-hydroxy-4-{[(1S,2R)-2-hydroxy-2,3-dihydro-1H-inden-1-yl]carbamoyl}-1-phenylbutan-2-yl]carbamate
Type:
Small organic molecule
Emp. Form.:
C34H43N3O6
Mol. Mass.:
589.7217
SMILES:
CCOc1ccc(CN[C@H]([C@H](O)[C@H](Cc2ccccc2)NC(=O)OC(C)(C)C)C(=O)N[C@@H]2[C@H](O)Cc3ccccc23)cc1
: