Target
Acetylcholinesterase
Ligand
BDBM9385
Substrate
Meas. Tech.
ChEMBL_28928 (CHEMBL857056)
IC50
559.76±n/a nM
Citation
 Tong, WCollantes, ERChen, YWelsh, WJ A comparative molecular field analysis study of N-benzylpiperidines as acetylcholinesterase inhibitors. J Med Chem 39:380-7 (1996)  
Target
Name:
Acetylcholinesterase
Synonyms:
ACES_MOUSE Acetylcholinesterase (mouse AChE) Ache
Type:
Enzyme
Mol. Mass.:
68165.65
Organism:
Mus musculus (mouse)
Description:
Residue:
614
  
Inhibitor
Name:
BDBM9385
Synonyms:
1-Benzyl-4-[2-(N-benzoylamino)ethyl]piperidine Hydrochloride N-(2-(1-benzylpiperidin-4-yl)ethyl)benzamide Piperidine Derivative 3a
Type:
Small organic molecule
Emp. Form.:
C21H26N2O
Mol. Mass.:
322.4439
SMILES:
O=C(NCCC1CCN(Cc2ccccc2)CC1)c1ccccc1
: