Target
Acetylcholinesterase
Ligand
BDBM50003996
Substrate
Meas. Tech.
ChEMBL_28928 (CHEMBL857056)
IC50
5.4±n/a nM
Citation
 Tong, WCollantes, ERChen, YWelsh, WJ A comparative molecular field analysis study of N-benzylpiperidines as acetylcholinesterase inhibitors. J Med Chem 39:380-7 (1996)  
Target
Name:
Acetylcholinesterase
Synonyms:
ACES_MOUSE Acetylcholinesterase (mouse AChE) Ache
Type:
Enzyme
Mol. Mass.:
68165.65
Organism:
Mus musculus (mouse)
Description:
Residue:
614
  
Inhibitor
Name:
BDBM50003996
Synonyms:
CHEMBL126354 N-[2-(1-Benzyl-piperidin-4-yl)-ethyl]-4-nitro-N-phenyl-benzamide
Type:
Small organic molecule
Emp. Form.:
C27H29N3O3
Mol. Mass.:
443.5375
SMILES:
[O-][N+](=O)c1ccc(cc1)C(=O)N(CCC1CCN(Cc2ccccc2)CC1)c1ccccc1
: