Target
Acetylcholinesterase
Ligand
BDBM50004027
Substrate
Meas. Tech.
ChEMBL_28928 (CHEMBL857056)
IC50
52±n/a nM
Citation
 Tong, WCollantes, ERChen, YWelsh, WJ A comparative molecular field analysis study of N-benzylpiperidines as acetylcholinesterase inhibitors. J Med Chem 39:380-7 (1996)  
Target
Name:
Acetylcholinesterase
Synonyms:
ACES_MOUSE Acetylcholinesterase (mouse AChE) Ache
Type:
Enzyme
Mol. Mass.:
68165.65
Organism:
Mus musculus (mouse)
Description:
Residue:
614
  
Inhibitor
Name:
BDBM50004027
Synonyms:
CHEMBL340672 N-[2-(1-Benzyl-piperidin-4-yl)-ethyl]-N-phenyl-acetamide
Type:
Small organic molecule
Emp. Form.:
C22H28N2O
Mol. Mass.:
336.4705
SMILES:
CC(=O)N(CCC1CCN(Cc2ccccc2)CC1)c1ccccc1
: