Target
Acetylcholinesterase
Ligand
BDBM9393
Substrate
Meas. Tech.
ChEMBL_28928 (CHEMBL857056)
IC50
119.95±n/a nM
Citation
 Tong, WCollantes, ERChen, YWelsh, WJ A comparative molecular field analysis study of N-benzylpiperidines as acetylcholinesterase inhibitors. J Med Chem 39:380-7 (1996)  
Target
Name:
Acetylcholinesterase
Synonyms:
ACES_MOUSE Acetylcholinesterase (mouse AChE) Ache
Type:
Enzyme
Mol. Mass.:
68165.65
Organism:
Mus musculus (mouse)
Description:
Residue:
614
  
Inhibitor
Name:
BDBM9393
Synonyms:
CHEMBL56586 Piperidine Derivative 3i
Type:
Small organic molecule
Emp. Form.:
C22H26N2O2
Mol. Mass.:
350.454
SMILES:
O=Cc1ccc(cc1)C(=O)NCCC1CCN(Cc2ccccc2)CC1
: