Target
Acetylcholinesterase
Ligand
BDBM50039728
Substrate
Meas. Tech.
ChEMBL_28756 (CHEMBL641020)
IC50
7.8±n/a nM
Citation
 Tong, WCollantes, ERChen, YWelsh, WJ A comparative molecular field analysis study of N-benzylpiperidines as acetylcholinesterase inhibitors. J Med Chem 39:380-7 (1996)  
Target
Name:
Acetylcholinesterase
Synonyms:
ACES_HUMAN Acetylcholinesterase (AChE) | Acetylcholinesterase (human AChE)
Type:
Enzyme
Mol. Mass.:
67792.70
Organism:
Homo sapiens (Human)
Description:
P22303
Residue:
614
  
Inhibitor
Name:
BDBM50039728
Synonyms:
3-(2-(1-benzylpiperidin-4-yl)ethyl)-5-methylbenzo[d]isoxazole CHEMBL433379
Type:
Small organic molecule
Emp. Form.:
C22H26N2O
Mol. Mass.:
334.4546
SMILES:
Cc1ccc2onc(CCC3CCN(Cc4ccccc4)CC3)c2c1
: