Target
Acetylcholinesterase
Ligand
BDBM50039734
Substrate
Meas. Tech.
ChEMBL_28756 (CHEMBL641020)
IC50
50±n/a nM
Citation
 Tong, WCollantes, ERChen, YWelsh, WJ A comparative molecular field analysis study of N-benzylpiperidines as acetylcholinesterase inhibitors. J Med Chem 39:380-7 (1996)  
Target
Name:
Acetylcholinesterase
Synonyms:
ACES_HUMAN Acetylcholinesterase (AChE) | Acetylcholinesterase (human AChE)
Type:
Enzyme
Mol. Mass.:
67792.70
Organism:
Homo sapiens (Human)
Description:
P22303
Residue:
614
  
Inhibitor
Name:
BDBM50039734
Synonyms:
3-(2-(1-benzylpiperidin-4-yl)ethyl)-6-bromobenzo[d]isoxazole CHEMBL330004
Type:
Small organic molecule
Emp. Form.:
C21H23BrN2O
Mol. Mass.:
399.324
SMILES:
Brc1ccc2c(CCC3CCN(Cc4ccccc4)CC3)noc2c1
: