Target
Acetylcholinesterase
Ligand
BDBM9410
Substrate
Meas. Tech.
ChEMBL_28928 (CHEMBL857056)
IC50
0.301±n/a nM
Citation
 Tong, WCollantes, ERChen, YWelsh, WJ A comparative molecular field analysis study of N-benzylpiperidines as acetylcholinesterase inhibitors. J Med Chem 39:380-7 (1996)  
Target
Name:
Acetylcholinesterase
Synonyms:
ACES_MOUSE Acetylcholinesterase (mouse AChE) Ache
Type:
Enzyme
Mol. Mass.:
68165.65
Organism:
Mus musculus (mouse)
Description:
Residue:
614
  
Inhibitor
Name:
BDBM9410
Synonyms:
N-[2-(1-benzylpiperidin-4-yl)ethyl]-N-ethyl-4-(phenylmethane)sulfonylbenzamide | Piperidine Derivative 22
Type:
Small organic molecule
Emp. Form.:
C30H36N2O3S
Mol. Mass.:
504.683
SMILES:
CCN(CCC1CCN(Cc2ccccc2)CC1)C(=O)c1ccc(cc1)S(=O)(=O)Cc1ccccc1
: