Target
Thymidylate synthase
Ligand
BDBM50408129
Substrate
Meas. Tech.
ChEMBL_209984 (CHEMBL821265)
Ki
3±n/a nM
Citation
 Bavetsias, VJackman, ALMarriott, JHKimbell, RGibson, WBoyle, FTBisset, GM Folate-based inhibitors of thymidylate synthase: synthesis and antitumor activity of gamma-linked sterically hindered dipeptide analogues of 2-desamino-2-methyl-N10-propargyl-5,8-dideazafolic acid (ICI 198583). J Med Chem 40:1495-510 (1997)  
Target
Name:
Thymidylate synthase
Synonyms:
TS TYSY_MOUSE | Tyms
Type:
PROTEIN
Mol. Mass.:
34957.15
Organism:
Mus musculus
Description:
ChEMBL_1340097
Residue:
307
  
Inhibitor
Name:
BDBM50408129
Synonyms:
CHEMBL289749
Type:
Small organic molecule
Emp. Form.:
C30H34FN5O9
Mol. Mass.:
627.6175
SMILES:
CN(Cc1cc2c(cc1C)nc(C)[nH]c2=O)c1ccc(C(=O)N[C@@H](CCC(O)=O)C(=O)N(C)[C@@H](CCC(O)=O)C(O)=O)c(F)c1
: