Target
Acetylcholinesterase
Ligand
BDBM50055159
Substrate
Meas. Tech.
ChEMBL_29849 (CHEMBL641238)
IC50
84722.74±n/a nM
Citation
 So, SSKarplus, M Three-dimensional quantitative structure-activity relationships from molecular similarity matrices and genetic neural networks. 2. Applications. J Med Chem 40:4360-71 (1998)  
Target
Name:
Acetylcholinesterase
Synonyms:
ACES_HUMAN Acetylcholinesterase (AChE) | Acetylcholinesterase (human AChE)
Type:
Enzyme
Mol. Mass.:
67792.70
Organism:
Homo sapiens (Human)
Description:
P22303
Residue:
614
  
Inhibitor
Name:
BDBM50055159
Synonyms:
CHEMBL136916 Trimethyl-(4-oxo-pentyl)-ammonium; iodide
Type:
Small organic molecule
Emp. Form.:
C8H18NO
Mol. Mass.:
144.2341
SMILES:
CC(=O)CCC[N+](C)(C)C
: