Target
Acetylcholinesterase
Ligand
BDBM50055192
Substrate
Meas. Tech.
ChEMBL_29849 (CHEMBL641238)
IC50
659.17±n/a nM
Citation
 So, SSKarplus, M Three-dimensional quantitative structure-activity relationships from molecular similarity matrices and genetic neural networks. 2. Applications. J Med Chem 40:4360-71 (1998)  
Target
Name:
Acetylcholinesterase
Synonyms:
ACES_HUMAN Acetylcholinesterase (AChE) | Acetylcholinesterase (human AChE)
Type:
Enzyme
Mol. Mass.:
67792.70
Organism:
Homo sapiens (Human)
Description:
P22303
Residue:
614
  
Inhibitor
Name:
BDBM50055192
Synonyms:
(3-Acetoxy-4-methyl-phenyl)-trimethyl-ammonium | CHEMBL139330
Type:
Small organic molecule
Emp. Form.:
C12H18NO2
Mol. Mass.:
208.2763
SMILES:
CC(=O)Oc1cc(ccc1C)[N+](C)(C)C
: