Target
Cathepsin K
Ligand
BDBM50408517
Substrate
Meas. Tech.
ChEMBL_48330 (CHEMBL663319)
Ki
27±n/a nM
Citation
 Thompson, SKSmith, WWZhao, BHalbert, SMTomaszek, TATew, DGLevy, MAJanson, CADAlessio, KJMcQueney, MSKurdyla, JJones, CSDesJarlais, RLAbdel-Meguid, SSVeber, DF Structure-based design of cathepsin K inhibitors containing a benzyloxy-substituted benzoyl peptidomimetic. J Med Chem 41:3923-7 (1998)  
Target
Name:
Cathepsin K
Synonyms:
CATK_HUMAN CTSO Cathepsin O Cathepsin X
Type:
Enzyme
Mol. Mass.:
36975.68
Organism:
Homo sapiens (Human)
Description:
P43235
Residue:
329
  
Inhibitor
Name:
BDBM50408517
Synonyms:
CHEMBL340191
Type:
Small organic molecule
Emp. Form.:
C29H33N5O6
Mol. Mass.:
547.6022
SMILES:
CC(C)C[C@H](NC(=O)OCc1ccccc1)C(=O)NNC(=O)NNC(=O)c1cccc(OCc2ccccc2)c1
: