Target
5-hydroxytryptamine receptor 1B
Ligand
BDBM50408706
Substrate
Meas. Tech.
ChEMBL_1383 (CHEMBL616455)
Ki
12.59±n/a nM
Citation
 Gaster, LMBlaney, FEDavies, SDuckworth, DMHam, PJenkins, SJennings, AJJoiner, GFKing, FDMulholland, KRWyman, PAHagan, JJHatcher, JJones, BJMiddlemiss, DNPrice, GWRiley, GRoberts, CRoutledge, CSelkirk, JSlade, PD The selective 5-HT1B receptor inverse agonist 1'-methyl-5-[[2'-methyl-4'-(5-methyl-1,2, 4-oxadiazol-3-yl)biphenyl-4-yl]carbonyl]-2,3,6,7-tetrahydro- spiro[furo[2,3-f]indole-3,4'-piperidine] (SB-224289) potently blocks terminal 5-HT autoreceptor function both in vitro and in vivo. J Med Chem 41:1218-35 (1998)  
Target
Name:
5-hydroxytryptamine receptor 1B
Synonyms:
5-HT-1B 5-HT1B 5HT1B_HUMAN HTR1DB Serotonin (5-HT) receptor Serotonin Receptor 1B
Type:
G Protein-Coupled Receptor (GPCR)
Mol. Mass.:
43579.17
Organism:
Homo sapiens (Human)
Description:
Receptor binding assays were performed using human clone stably expressed in CHO cells
Residue:
390
  
Inhibitor
Name:
BDBM50408706
Synonyms:
CHEMBL20771
Type:
Small organic molecule
Emp. Form.:
C20H24BrN3O
Mol. Mass.:
402.328
SMILES:
CN1CCN(CC1)c1cc(NC(=O)c2ccc(Br)c(C)c2)ccc1C
: