Target
5-hydroxytryptamine receptor 1B
Ligand
BDBM50084959
Substrate
Meas. Tech.
ChEMBL_1383 (CHEMBL616455)
Ki
6.31±n/a nM
Citation
 Gaster, LMBlaney, FEDavies, SDuckworth, DMHam, PJenkins, SJennings, AJJoiner, GFKing, FDMulholland, KRWyman, PAHagan, JJHatcher, JJones, BJMiddlemiss, DNPrice, GWRiley, GRoberts, CRoutledge, CSelkirk, JSlade, PD The selective 5-HT1B receptor inverse agonist 1'-methyl-5-[[2'-methyl-4'-(5-methyl-1,2, 4-oxadiazol-3-yl)biphenyl-4-yl]carbonyl]-2,3,6,7-tetrahydro- spiro[furo[2,3-f]indole-3,4'-piperidine] (SB-224289) potently blocks terminal 5-HT autoreceptor function both in vitro and in vivo. J Med Chem 41:1218-35 (1998)  
Target
Name:
5-hydroxytryptamine receptor 1B
Synonyms:
5-HT-1B 5-HT1B 5HT1B_HUMAN HTR1DB Serotonin (5-HT) receptor Serotonin Receptor 1B
Type:
G Protein-Coupled Receptor (GPCR)
Mol. Mass.:
43579.17
Organism:
Homo sapiens (Human)
Description:
Receptor binding assays were performed using human clone stably expressed in CHO cells
Residue:
390
  
Inhibitor
Name:
BDBM50084959
Synonyms:
11'-Methyl-5-[[2'-methyl-4'-(5-methyl-1,2,4-oxadiazol-3-yl)biphenyl-4-yl]carbonyl]-2,3,6,7-tetrahydrospiro[furo-[2,3-f]indole-3,4'-piperidine](SB-224289) CHEMBL281350 [2'-Methyl-4'-(5-methyl-[1,2,4]oxadiazol-3-yl)-biphenyl-4-yl]-[3-(1-methyl-piperidine)-2,3,6,7-tetrahydro-1-oxa-5-aza-s-indacen-5-yl]-methanone
Type:
Small organic molecule
Emp. Form.:
C32H32N4O3
Mol. Mass.:
520.6215
SMILES:
CN1CCC2(COc3cc4CCN(C(=O)c5ccc(cc5)-c5ccc(cc5C)-c5noc(C)n5)c4cc23)CC1
: